BDBM501763 4-[6-(4-aminopiperidin-1-yl)-4- benzyl-5-oxo-4,5-dihydropyrazin- 2-yl]benzonitrile::US11028066, Example 1
SMILES NC1CCN(CC1)c1nc(cn(Cc2ccccc2)c1=O)-c1ccc(cc1)C#N
InChI Key InChIKey=ATFYVENXLMEHIC-UHFFFAOYSA-N
Data  1 IC50
  Tab Delimited (TSV)   2D SDfile   Computed 3D by Vconf -m prep SDfile
Find this compound or compounds like it in BindingDB:
Activity Spreadsheet -- Enzyme Inhibition Constant Data from BindingDB
Found 1 hit for monomerid = 501763
TargetLysine-specific histone demethylase 1A(Homo sapiens (Human))
Celgene Quanticel Research
US Patent
LigandPNGBDBM501763(4-[6-(4-aminopiperidin-1-yl)-4- benzyl-5-oxo-4,5-...)
Affinity DataIC50: <100nM. Assay description: The enzymatic assay of LSD1 activity is based on Time Resolved-Fluorescence Resonance Energy Transfer (TR-FRET) detection. The inhibitory properties ...
Ligand InfoPC cidPC sid
In DepthDetails US Patent