BDBM50176402 2-(2-chlorophenyl)-3-(4-chlorophenyl)-6-(2,2,2-trifluoroethyl)-2H-pyrazolo[3,4-c]pyridin-7(6H)-one::CHEMBL379246
SMILES FC(F)(F)Cn1ccc2c(-c3ccc(Cl)cc3)n(nc2c1=O)-c1ccccc1Cl
InChI Key InChIKey=OZKNIYDKUNRBKX-UHFFFAOYSA-N
Data  3 KI
  Tab Delimited (TSV)   2D SDfile   Computed 3D by Vconf -m prep SDfile
Find this compound or compounds like it in BindingDB:
Activity Spreadsheet -- Enzyme Inhibition Constant Data from BindingDB
Found 3 hits for monomerid = 50176402
TargetCannabinoid receptor 1(Homo sapiens (Human))
Pfizer
Curated by ChEMBL
LigandPNGBDBM50176402(2-(2-chlorophenyl)-3-(4-chlorophenyl)-6-(2,2,2-tri...)
Affinity DataKi:  1nM. Assay description: Functional activity at human CB1 receptor transfected in CHOK1 cells by [35SGTP]gammaS assay
In DepthDetails ArticlePubMed
TargetCannabinoid receptor 1(Homo sapiens (Human))
Pfizer
Curated by ChEMBL
LigandPNGBDBM50176402(2-(2-chlorophenyl)-3-(4-chlorophenyl)-6-(2,2,2-tri...)
Affinity DataKi:  1nM. Assay description: Displacement of [3H]SR141716 from human CB1 receptor transfected in HEK293 cells
In DepthDetails ArticlePubMed
TargetCannabinoid receptor 2(Homo sapiens (Human))
Pfizer
Curated by ChEMBL
LigandPNGBDBM50176402(2-(2-chlorophenyl)-3-(4-chlorophenyl)-6-(2,2,2-tri...)
Affinity DataKi: >1.00E+4nM. Assay description: Binding affinity to human CB2 receptor expressed in CHOK1 cells
In DepthDetails ArticlePubMed