BDBM50176501 (S)-4-oxo-3-(6-(4-(quinoxalin-2-yloxy)benzamido)hexanamido)butanoic acid::CHEMBL201867
SMILES OC(=O)C[C@H](NC(=O)CCCCCNC(=O)c1ccc(Oc2cnc3ccccc3n2)cc1)C=O
InChI Key InChIKey=CIXOFJJFYICQAZ-SFHVURJKSA-N
Data  1 KI
  Tab Delimited (TSV)   2D SDfile   Computed 3D by Vconf -m prep SDfile
Find this compound or compounds like it in BindingDB:
Activity Spreadsheet -- Enzyme Inhibition Constant Data from BindingDB
Found 1 hit for monomerid = 50176501
TargetCaspase-1(Homo sapiens (Human))
Sunesis Pharmaceuticals
Curated by ChEMBL
LigandPNGBDBM50176501((S)-4-oxo-3-(6-(4-(quinoxalin-2-yloxy)benzamido)he...)
Affinity DataKi:  2.40E+3nM. Assay description: Inhibitory activity against human Caspase 1
In DepthDetails ArticlePubMed