BDBM50176518 (S)-4-oxo-3-(4-(4-(quinoxalin-2-ylamino)benzamido)butanamido)butanoic acid::CHEMBL202052
SMILES OC(=O)C[C@H](NC(=O)CCCNC(=O)c1ccc(Nc2cnc3ccccc3n2)cc1)C=O
InChI Key InChIKey=CYQYGHCVGOBRLU-KRWDZBQOSA-N
Data  1 KI
  Tab Delimited (TSV)   2D SDfile   Computed 3D by Vconf -m prep SDfile
Find this compound or compounds like it in BindingDB:
Activity Spreadsheet -- Enzyme Inhibition Constant Data from BindingDB
Found 1 hit for monomerid = 50176518
TargetCaspase-1(Homo sapiens (Human))
Sunesis Pharmaceuticals
Curated by ChEMBL
LigandPNGBDBM50176518((S)-4-oxo-3-(4-(4-(quinoxalin-2-ylamino)benzamido)...)
Affinity DataKi:  5.20E+3nM. Assay description: Inhibitory activity against human Caspase 1
In DepthDetails ArticlePubMed