BDBM50176706 1-(6-fluoropyridin-3-yl)-3-(3-methoxyquinuclidin-3-yl)-1-phenylprop-2-yn-1-ol::CHEMBL427013
SMILES COC1(CN2CCC1CC2)C#CC(O)(c1ccccc1)c1ccc(F)nc1
InChI Key InChIKey=NHSNVFUDXZEPFP-UHFFFAOYSA-N
Data  2 KI
  Tab Delimited (TSV)   2D SDfile   Computed 3D by Vconf -m prep SDfile
Find this compound or compounds like it in BindingDB:
Activity Spreadsheet -- Enzyme Inhibition Constant Data from BindingDB
Found 2 hits for monomerid = 50176706
TargetMuscarinic acetylcholine receptor M3(Homo sapiens (Human))
Ucb Pharma
Curated by ChEMBL
LigandPNGBDBM50176706(1-(6-fluoropyridin-3-yl)-3-(3-methoxyquinuclidin-3...)
Affinity DataKi:  0.320nM. Assay description: Binding affinity to human muscarinic M3 receptor
In DepthDetails ArticlePubMed
TargetMuscarinic acetylcholine receptor M2(Homo sapiens (Human))
Ucb Pharma
Curated by ChEMBL
LigandPNGBDBM50176706(1-(6-fluoropyridin-3-yl)-3-(3-methoxyquinuclidin-3...)
Affinity DataKi:  4nM. Assay description: Binding affinity to human muscarinic M2 receptor
In DepthDetails ArticlePubMed