BDBM50176831 CHEMBL376193::propyl 1-(2-chloro-2-phenylethyl)-4-(cyclopropylamino)-1H-pyrazolo[3,4-b]pyridine-5-carboxylate
SMILES CCCOC(=O)c1cnc2n(CC(Cl)c3ccccc3)ncc2c1NC1CC1
InChI Key InChIKey=WHZALKOISDRHIT-UHFFFAOYSA-N
Data  2 KI
  Tab Delimited (TSV)   2D SDfile   Computed 3D by Vconf -m prep SDfile
Find this compound or compounds like it in BindingDB:
Activity Spreadsheet -- Enzyme Inhibition Constant Data from BindingDB
Found 2 hits for monomerid = 50176831
TargetAdenosine receptor A1(BOVINE)
Università
Curated by ChEMBL
LigandPNGBDBM50176831(CHEMBL376193 | propyl 1-(2-chloro-2-phenylethyl)-4...)
Affinity DataKi:  156nM. Assay description: Displacement of [3H]DPCPX from adenosine A1 receptor in bovine cerebral cortical membranes
In DepthDetails ArticlePubMed
TargetAdenosine receptor A2a(Homo sapiens (Human))
Università
Curated by ChEMBL
LigandPNGBDBM50176831(CHEMBL376193 | propyl 1-(2-chloro-2-phenylethyl)-4...)
Affinity DataKi:  1.56E+3nM. Assay description: Displacement of [3H]CGS21680 from adenosine A2A receptor in bovine cerebral cortical membranes
In DepthDetails ArticlePubMed