BDBM50177132 CHEMBL3814818
SMILES Cc1ccc(Oc2cccc(COc3ccccc3CCC(=O)O[C@@H]3CCCO[C@@H]3COP(O)(=O)OC[C@H](N)C(O)=O)c2)cc1
InChI Key InChIKey=RTEJSUMZCQNBPP-GNSPLJBXSA-N
Data  2 EC50
  Tab Delimited (TSV)   2D SDfile   Computed 3D by Vconf -m prep SDfile
Find this compound or compounds like it in BindingDB:
Activity Spreadsheet -- Enzyme Inhibition Constant Data from BindingDB
Found 2 hits for monomerid = 50177132
TargetProbable G-protein coupled receptor 34(Mus musculus)
The University Of Tokyo
Curated by ChEMBL
LigandPNGBDBM50177132(CHEMBL3814818)
Affinity DataEC50:  76nM. Assay description: Agonist activity at mouse GPR34 expressed in HEK293A cells cotransfected with chimeric Galphaq/il after 1.5 hrs by alkaline phosphatase tagged-TGFalp...
In DepthDetails ArticlePubMed
TargetProbable G-protein coupled receptor 34(Mus musculus)
The University Of Tokyo
Curated by ChEMBL
LigandPNGBDBM50177132(CHEMBL3814818)
Affinity DataEC50:  77nM. Assay description: Agonist activity at mouse GPR34 expressed in HEK293A cells cotransfected with chimeric Galphaq/il after 1.5 hrs by alkaline phosphatase tagged-TGFalp...
In DepthDetails ArticlePubMed