BDBM50177274 4'-trifluoromethyl-biphenyl-4-carboxylic acid {2-[(2-dimethylamino-ethyl)-methyl-amino]-4-methyl-quinolin-6-yl}-amide::CHEMBL202854
SMILES CN(C)CCN(C)c1cc(C)c2cc(NC(=O)c3ccc(cc3)-c3ccc(cc3)C(F)(F)F)ccc2n1
InChI Key InChIKey=FCYYWOZROBLFFV-UHFFFAOYSA-N
Data  3 IC50
  Tab Delimited (TSV)   2D SDfile   Computed 3D by Vconf -m prep SDfile
Find this compound or compounds like it in BindingDB:
Activity Spreadsheet -- Enzyme Inhibition Constant Data from BindingDB
Found 3 hits for monomerid = 50177274
TargetMelanin-concentrating hormone receptor 1(Homo sapiens (Human))
7Tm Pharma
Curated by ChEMBL
LigandPNGBDBM50177274(4'-trifluoromethyl-biphenyl-4-carboxylic acid {2-[...)
Affinity DataIC50:  474nM. Assay description: Displacement of [3H]myo-inositol from human MCH1 receptor expressed in CHO cell by IP3 assay
In DepthDetails ArticlePubMed
TargetMelanin-concentrating hormone receptor 1(Homo sapiens (Human))
7Tm Pharma
Curated by ChEMBL
LigandPNGBDBM50177274(4'-trifluoromethyl-biphenyl-4-carboxylic acid {2-[...)
Affinity DataIC50:  10nM. Assay description: Displacement of [125I]MCH from human MCH1 receptor expressed in CHO cell by WC assay
In DepthDetails ArticlePubMed
TargetMelanin-concentrating hormone receptor 1(Homo sapiens (Human))
7Tm Pharma
Curated by ChEMBL
LigandPNGBDBM50177274(4'-trifluoromethyl-biphenyl-4-carboxylic acid {2-[...)
Affinity DataIC50:  63nM. Assay description: Inhibition of human MCH1 receptor by SPA assay
In DepthDetails ArticlePubMed