BDBM50177342 1-(4-(4-(2-tert-butyl-6-(trifluoromethyl)pyrimidin-4-yl)piperazin-1-yl)butyl)-4-(piperidin-1-yl)pyrimidin-2(1H)-one::CHEMBL201376
SMILES CC(C)(C)c1nc(cc(n1)C(F)(F)F)N1CCN(CCCCn2ccc(nc2=O)N2CCCCC2)CC1
InChI Key InChIKey=WZWWBVCSJDIKCC-UHFFFAOYSA-N
Data  2 KI
  Tab Delimited (TSV)   2D SDfile   Computed 3D by Vconf -m prep SDfile
Find this compound or compounds like it in BindingDB:
Activity Spreadsheet -- Enzyme Inhibition Constant Data from BindingDB
Found 2 hits for monomerid = 50177342
TargetD(3) dopamine receptor(Homo sapiens (Human))
Abbott
Curated by ChEMBL
LigandPNGBDBM50177342(1-(4-(4-(2-tert-butyl-6-(trifluoromethyl)pyrimidin...)
Affinity DataKi:  3.40nM. Assay description: Binding affinity to human cloned dopamine D3 receptor
In DepthDetails ArticlePubMed
TargetD(2) dopamine receptor(Homo sapiens (Human))
Abbott
Curated by ChEMBL
LigandPNGBDBM50177342(1-(4-(4-(2-tert-butyl-6-(trifluoromethyl)pyrimidin...)
Affinity DataKi:  89.4nM. Assay description: Binding affinity to human cloned dopamine D2 receptor
In DepthDetails ArticlePubMed