BDBM50179059 8-chloro-1,2,3,5,6,11-hexahydro-5,11-diaza-benzo[a]trinden-4-one::CHEMBL380488
SMILES Clc1ccc2[nH]c3c4CCCc4c4C(=O)NCc4c3c2c1
InChI Key InChIKey=KPLKXKHWRLQXTB-UHFFFAOYSA-N
Data  1 IC50
  Tab Delimited (TSV)   2D SDfile   Computed 3D by Vconf -m prep SDfile
Find this compound or compounds like it in BindingDB:
Activity Spreadsheet -- Enzyme Inhibition Constant Data from BindingDB
Found 1 hit for monomerid = 50179059
TargetPoly [ADP-ribose] polymerase 1(Homo sapiens (Human))
Cephalon
Curated by ChEMBL
LigandPNGBDBM50179059(8-chloro-1,2,3,5,6,11-hexahydro-5,11-diaza-benzo[a...)
Affinity DataIC50:  120nM. Assay description: Inhibition of recombinant human PARP1
In DepthDetails ArticlePubMed