BDBM50179153 2-((1H-pyrrolo[3,2-c]pyridin-1-yl)methyl)-N-(4-chloro-3-(trifluoromethyl)phenyl)benzamide::CHEMBL437889
SMILES FC(F)(F)c1cc(NC(=O)c2ccccc2Cn2ccc3cnccc23)ccc1Cl
InChI Key InChIKey=JYAHZCJXHOFSSE-UHFFFAOYSA-N
Data  2 IC50
  Tab Delimited (TSV)   2D SDfile   Computed 3D by Vconf -m prep SDfile
Find this compound or compounds like it in BindingDB:
Activity Spreadsheet -- Enzyme Inhibition Constant Data from BindingDB
Found 2 hits for monomerid = 50179153
TargetVascular endothelial growth factor receptor 1(Homo sapiens (Human))
Chemical Diversity
Curated by ChEMBL
LigandPNGBDBM50179153(2-((1H-pyrrolo[3,2-c]pyridin-1-yl)methyl)-N-(4-chl...)
Affinity DataIC50:  410nM. Assay description: Inhibitory activity against VEGFR-1 using 2 uM ATP by HTRF assay
In DepthDetails ArticlePubMed
TargetVascular endothelial growth factor receptor 2(Homo sapiens (Human))
Chemical Diversity
Curated by ChEMBL
LigandPNGBDBM50179153(2-((1H-pyrrolo[3,2-c]pyridin-1-yl)methyl)-N-(4-chl...)
Affinity DataIC50:  310nM. Assay description: Inhibitory activity against VEGFR-2 using 2 uM ATP by HTRF assay
In DepthDetails ArticlePubMed