BDBM50179161 CHEMBL206215::N-(4-chlorophenyl)-2-((4-(pyridin-3-yl)-1H-pyrazol-1-yl)methyl)benzamide
SMILES Clc1ccc(NC(=O)c2ccccc2Cn2cc(cn2)-c2cccnc2)cc1
InChI Key InChIKey=JTSHPPXRGYJGQY-UHFFFAOYSA-N
Data  2 IC50
  Tab Delimited (TSV)   2D SDfile   Computed 3D by Vconf -m prep SDfile
Find this compound or compounds like it in BindingDB:
Activity Spreadsheet -- Enzyme Inhibition Constant Data from BindingDB
Found 2 hits for monomerid = 50179161
TargetVascular endothelial growth factor receptor 1(Homo sapiens (Human))
Chemical Diversity
Curated by ChEMBL
LigandPNGBDBM50179161(CHEMBL206215 | N-(4-chlorophenyl)-2-((4-(pyridin-3...)
Affinity DataIC50: >1.00E+4nM. Assay description: Inhibitory activity against VEGFR-1 using 2 uM ATP by HTRF assay
In DepthDetails ArticlePubMed
TargetVascular endothelial growth factor receptor 2(Homo sapiens (Human))
Chemical Diversity
Curated by ChEMBL
LigandPNGBDBM50179161(CHEMBL206215 | N-(4-chlorophenyl)-2-((4-(pyridin-3...)
Affinity DataIC50: >1.00E+4nM. Assay description: Inhibitory activity against VEGFR-2 using 2 uM ATP by HTRF assay
In DepthDetails ArticlePubMed