BDBM50179165 2-(2-((1H-pyrrolo[3,2-c]pyridin-1-yl)methyl)phenyl)-5-chloro-1H-benzo[d]imidazole::CHEMBL381603
SMILES Clc1ccc2nc([nH]c2c1)-c1ccccc1Cn1ccc2cnccc12
InChI Key InChIKey=JNJLFISRSZHOHY-UHFFFAOYSA-N
Data  1 IC50
  Tab Delimited (TSV)   2D SDfile   Computed 3D by Vconf -m prep SDfile
Find this compound or compounds like it in BindingDB:
Activity Spreadsheet -- Enzyme Inhibition Constant Data from BindingDB
Found 1 hit for monomerid = 50179165
TargetVascular endothelial growth factor receptor 2(Homo sapiens (Human))
Chemical Diversity
Curated by ChEMBL
LigandPNGBDBM50179165(2-(2-((1H-pyrrolo[3,2-c]pyridin-1-yl)methyl)phenyl...)
Affinity DataIC50:  2.66E+3nM. Assay description: Inhibitory activity against VEGFR-2 using 2 uM ATP by HTRF assay
In DepthDetails ArticlePubMed