BDBM50179172 2-((1H-pyrrolo[3,2-c]pyridin-1-yl)methyl)-N-(4-bromophenyl)benzamide::CHEMBL203063
SMILES Brc1ccc(NC(=O)c2ccccc2Cn2ccc3cnccc23)cc1
InChI Key InChIKey=POKUXORWYHOFMV-UHFFFAOYSA-N
Data  2 IC50
  Tab Delimited (TSV)   2D SDfile   Computed 3D by Vconf -m prep SDfile
Find this compound or compounds like it in BindingDB:
Activity Spreadsheet -- Enzyme Inhibition Constant Data from BindingDB
Found 2 hits for monomerid = 50179172
TargetVascular endothelial growth factor receptor 2(Homo sapiens (Human))
Chemical Diversity
Curated by ChEMBL
LigandPNGBDBM50179172(2-((1H-pyrrolo[3,2-c]pyridin-1-yl)methyl)-N-(4-bro...)
Affinity DataIC50:  440nM. Assay description: Inhibitory activity against VEGFR-2 using 2 uM ATP by HTRF assay
In DepthDetails ArticlePubMed
TargetVascular endothelial growth factor receptor 1(Homo sapiens (Human))
Chemical Diversity
Curated by ChEMBL
LigandPNGBDBM50179172(2-((1H-pyrrolo[3,2-c]pyridin-1-yl)methyl)-N-(4-bro...)
Affinity DataIC50:  950nM. Assay description: Inhibitory activity against VEGFR-1 using 2 uM ATP by HTRF assay
In DepthDetails ArticlePubMed