BDBM50179287 2-(1H-imidazo[4,5-b]pyridin-2-yl)quinoxaline::CHEMBL198561
SMILES c1ccc2nc(cnc2c1)-c1nc2ncccc2[nH]1
InChI Key InChIKey=YDZKEBIUBYPARC-UHFFFAOYSA-N
Data  3 KI
  Tab Delimited (TSV)   2D SDfile   Computed 3D by Vconf -m prep SDfile
Find this compound or compounds like it in BindingDB:
Activity Spreadsheet -- Enzyme Inhibition Constant Data from BindingDB
Found 3 hits for monomerid = 50179287
TargetAdenosine receptor A3(Homo sapiens (Human))
Universit£
Curated by ChEMBL
LigandPNGBDBM50179287(2-(1H-imidazo[4,5-b]pyridin-2-yl)quinoxaline | CHE...)
Affinity DataKi: >1.00E+3nM. Assay description: Displacement of [125I]AB-MECA from human adenosine A3 receptor expressed in CHO cells
In DepthDetails ArticlePubMed
TargetAdenosine receptor A2a(Homo sapiens (Human))
Universit£
Curated by ChEMBL
LigandPNGBDBM50179287(2-(1H-imidazo[4,5-b]pyridin-2-yl)quinoxaline | CHE...)
Affinity DataKi: >1.00E+4nM. Assay description: Displacement of [3H]NECA from human adenosine A2A receptor expressed in CHO cells
In DepthDetails ArticlePubMed
TargetAdenosine receptor A1(Homo sapiens (Human))
Universit£
Curated by ChEMBL
LigandPNGBDBM50179287(2-(1H-imidazo[4,5-b]pyridin-2-yl)quinoxaline | CHE...)
Affinity DataKi: >1.00E+4nM. Assay description: Displacement of [3H]DPCPX from human adenosine A1 receptor expressed in CHO cells
In DepthDetails ArticlePubMed