BDBM50179878 CHEMBL206192::N-(4-(1,1,1,3,3,3-hexafluoro-2-hydroxypropan-2-yl)phenyl)-N-methylthiophene-2-sulfonamide
SMILES CN(c1ccc(cc1)C(O)(C(F)(F)F)C(F)(F)F)S(=O)(=O)c1cccs1
InChI Key InChIKey=KHKGRAJSFGJEPY-UHFFFAOYSA-N
Data  1 EC50
  Tab Delimited (TSV)   2D SDfile   Computed 3D by Vconf -m prep SDfile
Find this compound or compounds like it in BindingDB:
Activity Spreadsheet -- Enzyme Inhibition Constant Data from BindingDB
Found 1 hit for monomerid = 50179878
TargetOxysterols receptor LXR-alpha(Homo sapiens (Human))
Amgen
Curated by ChEMBL
LigandPNGBDBM50179878(CHEMBL206192 | N-(4-(1,1,1,3,3,3-hexafluoro-2-hydr...)
Affinity DataEC50:  600nM. Assay description: Activity against LXR alpha transiently transfected in HEK293 cells
In DepthDetails ArticlePubMed