BDBM50180024 CHEMBL373169::N3-(4-cyanophenyl)-4-oxo-1-pentyl-1,4-dihydroquinoline-3-carboxamide
SMILES CCCCCn1cc(C(=O)Nc2ccc(cc2)C#N)c(=O)c2ccccc12
InChI Key InChIKey=SNLKBUWHICYJCF-UHFFFAOYSA-N
Data  1 KI
  Tab Delimited (TSV)   2D SDfile   Computed 3D by Vconf -m prep SDfile
Find this compound or compounds like it in BindingDB:
Activity Spreadsheet -- Enzyme Inhibition Constant Data from BindingDB
Found 1 hit for monomerid = 50180024
TargetCannabinoid receptor 2(Homo sapiens (Human))
Universit£
Curated by ChEMBL
LigandPNGBDBM50180024(CHEMBL373169 | N3-(4-cyanophenyl)-4-oxo-1-pentyl-1...)
Affinity DataKi:  772nM. Assay description: Displacement of [3H]CP-55940 from human CB2 receptor
In DepthDetails ArticlePubMed