BDBM50180327 2-[(1,5-Dimethyl-1H-pyrazol-3-yl)methylamino]-6-(3-acetamidophenyl)pyrazine::CHEMBL382262
SMILES CC(=O)Nc1cccc(c1)-c1cncc(NCc2cc(C)n[nH]2)n1
InChI Key InChIKey=GIHLYUUIMBKART-UHFFFAOYSA-N
Data  2 IC50
  Tab Delimited (TSV)   2D SDfile   Computed 3D by Vconf -m prep SDfile
Find this compound or compounds like it in BindingDB:
Activity Spreadsheet -- Enzyme Inhibition Constant Data from BindingDB
Found 2 hits for monomerid = 50180327
TargetSerine/threonine-protein kinase B-raf(Homo sapiens (Human))
Institute Of Cancer Research
Curated by ChEMBL
LigandPNGBDBM50180327(2-[(1,5-Dimethyl-1H-pyrazol-3-yl)methylamino]-6-(3...)
Affinity DataIC50:  1.80E+4nM. Assay description: Growth inhibition in human melanoma cells WM266.4 expressing mutant B-RAF with SRB
In DepthDetails ArticlePubMed
TargetSerine/threonine-protein kinase B-raf(Homo sapiens (Human))
Institute Of Cancer Research
Curated by ChEMBL
LigandPNGBDBM50180327(2-[(1,5-Dimethyl-1H-pyrazol-3-yl)methylamino]-6-(3...)
Affinity DataIC50:  1.40E+4nM. Assay description: Inhibitory activity against human B-RAF
In DepthDetails ArticlePubMed