BDBM50180359 2-(3-Oxo-1,3-dihydroisobenzofuran-5-ylamino)-6-(3-acetamidophenyl)pyrazine::CHEMBL199811
SMILES CC(=O)Nc1cccc(c1)-c1cncc(Nc2ccc3COC(=O)c3c2)n1
InChI Key InChIKey=BOJDCYLXQYKJPO-UHFFFAOYSA-N
Data  2 IC50
  Tab Delimited (TSV)   2D SDfile   Computed 3D by Vconf -m prep SDfile
Find this compound or compounds like it in BindingDB:
Activity Spreadsheet -- Enzyme Inhibition Constant Data from BindingDB
Found 2 hits for monomerid = 50180359
TargetSerine/threonine-protein kinase B-raf(Homo sapiens (Human))
Institute Of Cancer Research
Curated by ChEMBL
LigandPNGBDBM50180359(2-(3-Oxo-1,3-dihydroisobenzofuran-5-ylamino)-6-(3-...)
Affinity DataIC50:  740nM. Assay description: Inhibitory activity against human B-RAF
In DepthDetails ArticlePubMed
TargetSerine/threonine-protein kinase B-raf(Homo sapiens (Human))
Institute Of Cancer Research
Curated by ChEMBL
LigandPNGBDBM50180359(2-(3-Oxo-1,3-dihydroisobenzofuran-5-ylamino)-6-(3-...)
Affinity DataIC50:  490nM. Assay description: Growth inhibition in human melanoma cells WM266.4 expressing mutant B-RAF with SRB
In DepthDetails ArticlePubMed