BDBM501806 4-(6-{[((3S)-pyrrolidin-3- yl)methyl]amino}-4-(2- hydroxyethyl)-3-(4- methylphenyl)-5-oxo(4- hydropyrazin-2-yl))-2- fluorobenzenecarbonitrile::US11028066, Example 44
SMILES Cc1ccc(cc1)-c1c(nc(NC[C@H]2CCNC2)c(=O)n1CCO)-c1ccc(C#N)c(F)c1
InChI Key InChIKey=GFWMMMILHYKACP-KRWDZBQOSA-N
Data  1 IC50
  Tab Delimited (TSV)   2D SDfile   Computed 3D by Vconf -m prep SDfile
Find this compound or compounds like it in BindingDB:
Activity Spreadsheet -- Enzyme Inhibition Constant Data from BindingDB
Found 1 hit for monomerid = 501806
TargetLysine-specific histone demethylase 1A(Homo sapiens (Human))
Celgene Quanticel Research
US Patent
LigandPNGBDBM501806(4-(6-{[((3S)-pyrrolidin-3- yl)methyl]amino}-4-(2-...)
Affinity DataIC50: <100nM. Assay description: The enzymatic assay of LSD1 activity is based on Time Resolved-Fluorescence Resonance Energy Transfer (TR-FRET) detection. The inhibitory properties ...
Ligand InfoPC cidPC sid
In DepthDetails US Patent