BDBM50180613 CHEMBL3601632
SMILES COc1cccc(\C=C2/CCCC(C(=O)c3ccccc3)=C2O)c1
InChI Key InChIKey=PCSRSYFPEVTDPK-GHRIWEEISA-N
Data  1 IC50
  Tab Delimited (TSV)   2D SDfile   Computed 3D by Vconf -m prep SDfile
Find this compound or compounds like it in BindingDB:
Activity Spreadsheet -- Enzyme Inhibition Constant Data from BindingDB
Found 1 hit for monomerid = 50180613
TargetAcetylcholinesterase(Electrophorus electricus (Electric eel))
Universiti Putra Malaysia
Curated by ChEMBL
LigandPNGBDBM50180613(CHEMBL3601632)
Affinity DataIC50:  7.40E+3nM. Assay description: Inhibition of electric eel AChE preincubated for 15 mins followed by addition of acetylthiocholine iodide as substrate measured after 30 mins by Ellm...
In DepthDetails ArticlePubMed