BDBM50180904 7-cyclopropylmethyl-6,7,8,9,14,15-hexahydro-5H-benz[d]indolo[2,3-g]azecine::CHEMBL201432
SMILES C(C1CC1)N1CCc2c(Cc3ccccc3CC1)[nH]c1ccccc21
InChI Key InChIKey=JJMBGYMAWGZMGZ-UHFFFAOYSA-N
Data  4 KI
  Tab Delimited (TSV)   2D SDfile   Computed 3D by Vconf -m prep SDfile
Find this compound or compounds like it in BindingDB:
Activity Spreadsheet -- Enzyme Inhibition Constant Data from BindingDB
Found 4 hits for monomerid = 50180904
TargetD(1A) dopamine receptor(Homo sapiens (Human))
University Of Bonn
Curated by ChEMBL
LigandPNGBDBM50180904(7-cyclopropylmethyl-6,7,8,9,14,15-hexahydro-5H-ben...)
Affinity DataKi:  767nM. Assay description: Inhibition of binding to human D1 receptor expressed in HEK 293 cells by radioligand binding assay
In DepthDetails ArticlePubMed
TargetD(1B) dopamine receptor(Homo sapiens (Human))
University Of Bonn
Curated by ChEMBL
LigandPNGBDBM50180904(7-cyclopropylmethyl-6,7,8,9,14,15-hexahydro-5H-ben...)
Affinity DataKi:  893nM. Assay description: Inhibition of binding to human D5 receptor expressed in HEK 293 cells by radioligand binding assay
In DepthDetails ArticlePubMed
TargetD(4) dopamine receptor(Homo sapiens (Human))
University Of Bonn
Curated by ChEMBL
LigandPNGBDBM50180904(7-cyclopropylmethyl-6,7,8,9,14,15-hexahydro-5H-ben...)
Affinity DataKi: >5.00E+3nM. Assay description: Inhibition of binding to human D4 receptor expressed in HEK 293 cells by radioligand binding assay
In DepthDetails ArticlePubMed
TargetD(2) dopamine receptor(Homo sapiens (Human))
University Of Bonn
Curated by ChEMBL
LigandPNGBDBM50180904(7-cyclopropylmethyl-6,7,8,9,14,15-hexahydro-5H-ben...)
Affinity DataKi: >5.00E+3nM. Assay description: Inhibition of binding to human D2L receptor expressed in HEK 293 cells by radioligand binding assay
In DepthDetails ArticlePubMed