BDBM50181092 CHEMBL380954::N4-(2,6-difluorobenzyl)-N6,2-dicyclopropyl-5-methylpyrimidine-4,6-diamine
SMILES Cc1c(NCc2c(F)cccc2F)nc(nc1NC1CC1)C1CC1
InChI Key InChIKey=NTYZIRSXTSUBFT-UHFFFAOYSA-N
Data  1 KI
  Tab Delimited (TSV)   2D SDfile   Computed 3D by Vconf -m prep SDfile
Find this compound or compounds like it in BindingDB:
Activity Spreadsheet -- Enzyme Inhibition Constant Data from BindingDB
Found 1 hit for monomerid = 50181092
TargetMuscarinic acetylcholine receptor M3(Homo sapiens (Human))
Ucb Pharma
Curated by ChEMBL
LigandPNGBDBM50181092(CHEMBL380954 | N4-(2,6-difluorobenzyl)-N6,2-dicycl...)
Affinity DataKi:  63nM. Assay description: Displacement of [3H]methylscopolamine from recombinant human muscarinic M3 receptors expressed in CHO cells
In DepthDetails ArticlePubMed