BDBM50181133 CHEMBL380926::N,2-dicyclopropyl-5-methyl-6-(4-(trifluoromethyl)piperidin-1-yl)pyrimidin-4-amine
SMILES Cc1c(NC2CC2)nc(nc1N1CCC(CC1)C(F)(F)F)C1CC1
InChI Key InChIKey=YHGJKEPHPBNDOA-UHFFFAOYSA-N
Data  1 KI
  Tab Delimited (TSV)   2D SDfile   Computed 3D by Vconf -m prep SDfile
Find this compound or compounds like it in BindingDB:
Activity Spreadsheet -- Enzyme Inhibition Constant Data from BindingDB
Found 1 hit for monomerid = 50181133
TargetMuscarinic acetylcholine receptor M3(Homo sapiens (Human))
Ucb Pharma
Curated by ChEMBL
LigandPNGBDBM50181133(CHEMBL380926 | N,2-dicyclopropyl-5-methyl-6-(4-(tr...)
Affinity DataKi:  100nM. Assay description: Displacement of [3H]methylscopolamine from recombinant human muscarinic M3 receptors expressed in CHO cells
In DepthDetails ArticlePubMed