BDBM50181202 CHEMBL382138::ethyl 3-(5-(4-(4-(methylsulfonyl)benzylamino)phenyl)-2,6-diaminopyrimidin-4-yl)propanoate
SMILES CCOC(=O)CCc1nc(N)nc(N)c1-c1ccc(NCc2ccc(cc2)S(C)(=O)=O)cc1
InChI Key InChIKey=NDNAPUYFHLMQHR-UHFFFAOYSA-N
Data  1 IC50
  Tab Delimited (TSV)   2D SDfile   Computed 3D by Vconf -m prep SDfile
Find this compound or compounds like it in BindingDB:
Activity Spreadsheet -- Enzyme Inhibition Constant Data from BindingDB
Found 1 hit for monomerid = 50181202
TargetGrowth hormone secretagogue receptor type 1(Homo sapiens (Human))
Abbott Laboratories
Curated by ChEMBL
LigandPNGBDBM50181202(CHEMBL382138 | ethyl 3-(5-(4-(4-(methylsulfonyl)be...)
Affinity DataIC50:  82nM. Assay description: Inhibition of human GHS receptor by FLIPR
In DepthDetails ArticlePubMed