BDBM50181210 5-(4-(4-(methylsulfonyl)benzylamino)phenyl)-6-(((4-fluorophenyl)(methyl)amino)methyl)pyrimidine-2,4-diamine::CHEMBL383454
SMILES CN(Cc1nc(N)nc(N)c1-c1ccc(NCc2ccc(cc2)S(C)(=O)=O)cc1)c1ccc(F)cc1
InChI Key InChIKey=XKOSPQDHNPSTGR-UHFFFAOYSA-N
Data  1 IC50
  Tab Delimited (TSV)   2D SDfile   Computed 3D by Vconf -m prep SDfile
Find this compound or compounds like it in BindingDB:
Activity Spreadsheet -- Enzyme Inhibition Constant Data from BindingDB
Found 1 hit for monomerid = 50181210
TargetGrowth hormone secretagogue receptor type 1(Homo sapiens (Human))
Abbott Laboratories
Curated by ChEMBL
LigandPNGBDBM50181210(5-(4-(4-(methylsulfonyl)benzylamino)phenyl)-6-(((4...)
Affinity DataIC50:  10nM. Assay description: Inhibition of human GHS receptor by FLIPR
In DepthDetails ArticlePubMed