BDBM50181220 5-(4-(4-(methylsulfonyl)benzylamino)phenyl)-6-(2,3-dihydrobenzofuran-2-yl)pyrimidine-2,4-diamine::CHEMBL383757
SMILES CS(=O)(=O)c1ccc(CNc2ccc(cc2)-c2c(N)nc(N)nc2C2Cc3ccccc3O2)cc1
InChI Key InChIKey=QIQRAKCFXVLSCW-UHFFFAOYSA-N
Data  1 IC50
  Tab Delimited (TSV)   2D SDfile   Computed 3D by Vconf -m prep SDfile
Find this compound or compounds like it in BindingDB:
Activity Spreadsheet -- Enzyme Inhibition Constant Data from BindingDB
Found 1 hit for monomerid = 50181220
TargetGrowth hormone secretagogue receptor type 1(Homo sapiens (Human))
Abbott Laboratories
Curated by ChEMBL
LigandPNGBDBM50181220(5-(4-(4-(methylsulfonyl)benzylamino)phenyl)-6-(2,3...)
Affinity DataIC50:  38nM. Assay description: Inhibition of human GHS receptor by FLIPR
In DepthDetails ArticlePubMed