BDBM50181593 6-amino-3-(1,1-dioxo-1,2-dihydrobenzo[1,2,4]thiadiazin-3-yl)-4-hydroxy-1-(3-methylbutyl)-1H-quinolin-2-one::CHEMBL426302
SMILES CC(C)CCn1c2ccc(N)cc2c(O)c(C2=Nc3ccccc3S(=O)(=O)N2)c1=O
InChI Key InChIKey=JOEBQVGINQUNSN-UHFFFAOYSA-N
Data  1 IC50  1 EC50
  Tab Delimited (TSV)   2D SDfile   Computed 3D by Vconf -m prep SDfile
Find this compound or compounds like it in BindingDB:
Activity Spreadsheet -- Enzyme Inhibition Constant Data from BindingDB
Found 2 hits for monomerid = 50181593
TargetRNA-directed RNA polymerase(Hepatitis C virus)
Glaxosmithkline
Curated by ChEMBL
LigandPNGBDBM50181593(6-amino-3-(1,1-dioxo-1,2-dihydrobenzo[1,2,4]thiadi...)
Affinity DataEC50:  274nM. Assay description: Inhibition of HCV RNA replication in Huh7 cells
In DepthDetails ArticlePubMed
TargetRNA-directed RNA polymerase(Hepatitis C virus)
Glaxosmithkline
Curated by ChEMBL
LigandPNGBDBM50181593(6-amino-3-(1,1-dioxo-1,2-dihydrobenzo[1,2,4]thiadi...)
Affinity DataIC50:  62nM. Assay description: Inhibitory activity against HCV delta 21 NS5B RNA polymerase by SPA assay
In DepthDetails ArticlePubMed