BDBM50181623 3-(1,1-dioxo-1,4-dihydrobenzo[1,2,4]thiadiazin-3-yl)-4,5-dihydroxy-1-(3-methylbutyl)-1H-quninolin-2-one::CHEMBL201600
SMILES CC(C)CCn1c2cccc(O)c2c(O)c(C2=Nc3ccccc3S(=O)(=O)N2)c1=O
InChI Key InChIKey=LKYZJAXMQBRFMY-UHFFFAOYSA-N
Data  1 IC50
  Tab Delimited (TSV)   2D SDfile   Computed 3D by Vconf -m prep SDfile
Find this compound or compounds like it in BindingDB:
Activity Spreadsheet -- Enzyme Inhibition Constant Data from BindingDB
Found 1 hit for monomerid = 50181623
TargetRNA-directed RNA polymerase(Hepatitis C virus)
Glaxosmithkline
Curated by ChEMBL
LigandPNGBDBM50181623(3-(1,1-dioxo-1,4-dihydrobenzo[1,2,4]thiadiazin-3-y...)
Affinity DataIC50:  47nM. Assay description: Inhibitory activity against HCV delta 21 NS5B RNA polymerase by SPA assay
In DepthDetails ArticlePubMed