BDBM50181698 5-(4-chlorobenzylidene)-3-(benzoylamino)-4-oxo-2-thionothiazolidine::CHEMBL201469
SMILES Clc1ccc(C=C2SC(=S)N(NC(=O)c3ccccc3)C2=O)cc1
InChI Key InChIKey=MDHBIUIQMGWWTL-UHFFFAOYSA-N
Data  1 IC50
  Tab Delimited (TSV)   2D SDfile   Computed 3D by Vconf -m prep SDfile
Find this compound or compounds like it in BindingDB:
Activity Spreadsheet -- Enzyme Inhibition Constant Data from BindingDB
Found 1 hit for monomerid = 50181698
TargetRNA-directed RNA polymerase(Hepatitis C virus)
Amgen
Curated by ChEMBL
LigandPNGBDBM50181698(5-(4-chlorobenzylidene)-3-(benzoylamino)-4-oxo-2-t...)
Affinity DataIC50: >3.00E+4nM. Assay description: Inhibitory activity against HCV delta 21 NS5b RNA polymerase
In DepthDetails ArticlePubMed