BDBM50181706 5-(4-nitrobenzylidene)-3-(benzenesulfonylamino)-4-oxo-2-thionothiazolidine::CHEMBL202263
SMILES [O-][N+](=O)c1ccc(C=C2SC(=S)N(NS(=O)(=O)c3ccccc3)C2=O)cc1
InChI Key InChIKey=CPIVYYNPYXNXNA-UHFFFAOYSA-N
Data  1 IC50
  Tab Delimited (TSV)   2D SDfile   Computed 3D by Vconf -m prep SDfile
Find this compound or compounds like it in BindingDB:
Activity Spreadsheet -- Enzyme Inhibition Constant Data from BindingDB
Found 1 hit for monomerid = 50181706
TargetRNA-directed RNA polymerase(Hepatitis C virus)
Amgen
Curated by ChEMBL
LigandPNGBDBM50181706(5-(4-nitrobenzylidene)-3-(benzenesulfonylamino)-4-...)
Affinity DataIC50:  2.00E+3nM. Assay description: Inhibitory activity against HCV delta 21 NS5b RNA polymerase
In DepthDetails ArticlePubMed