BDBM50181749 4-(2-methoxyphenylethynyl)-2-methylthiazole::CHEMBL202002
SMILES COc1ccccc1C#Cc1csc(C)n1
InChI Key InChIKey=WOLUACOHPFWBIX-UHFFFAOYSA-N
Data  1 IC50
  Tab Delimited (TSV)   2D SDfile   Computed 3D by Vconf -m prep SDfile
Find this compound or compounds like it in BindingDB:
Activity Spreadsheet -- Enzyme Inhibition Constant Data from BindingDB
Found 1 hit for monomerid = 50181749
TargetMetabotropic glutamate receptor 5(Homo sapiens (Human))
University Of Illinois At Chicago
Curated by ChEMBL
LigandPNGBDBM50181749(4-(2-methoxyphenylethynyl)-2-methylthiazole | CHEM...)
Affinity DataIC50:  36.3nM. Assay description: Activity in agonist-induced phosphoinositide hydrolysis in CHO cells expressing mGluR5a
In DepthDetails ArticlePubMed