BDBM50181784 3-[(2-methyl-4-thiazolyl)ethynyl]phenol::CHEMBL201974
SMILES Cc1nc(cs1)C#Cc1cccc(O)c1
InChI Key InChIKey=HMWLZOIKORRPSN-UHFFFAOYSA-N
Data  1 IC50
  Tab Delimited (TSV)   2D SDfile   Computed 3D by Vconf -m prep SDfile
Find this compound or compounds like it in BindingDB:
Activity Spreadsheet -- Enzyme Inhibition Constant Data from BindingDB
Found 1 hit for monomerid = 50181784
TargetMetabotropic glutamate receptor 5(Homo sapiens (Human))
University Of Illinois At Chicago
Curated by ChEMBL
LigandPNGBDBM50181784(3-[(2-methyl-4-thiazolyl)ethynyl]phenol | CHEMBL20...)
Affinity DataIC50:  654nM. Assay description: Activity in agonist-induced phosphoinositide hydrolysis in CHO cells expressing mGluR5a
In DepthDetails ArticlePubMed