BDBM50181786 3-[(5-ethyl-2-methyl-4-thiazolyl)ethynyl]pyridine::CHEMBL202277
SMILES CCc1sc(C)nc1C#Cc1cccnc1
InChI Key InChIKey=SJJSHLRFCBWELS-UHFFFAOYSA-N
Data  1 IC50
  Tab Delimited (TSV)   2D SDfile   Computed 3D by Vconf -m prep SDfile
Find this compound or compounds like it in BindingDB:
Activity Spreadsheet -- Enzyme Inhibition Constant Data from BindingDB
Found 1 hit for monomerid = 50181786
TargetMetabotropic glutamate receptor 5(Homo sapiens (Human))
University Of Illinois At Chicago
Curated by ChEMBL
LigandPNGBDBM50181786(3-[(5-ethyl-2-methyl-4-thiazolyl)ethynyl]pyridine ...)
Affinity DataIC50:  1.24E+3nM. Assay description: Activity in agonist-induced phosphoinositide hydrolysis in CHO cells expressing mGluR5a
In DepthDetails ArticlePubMed