BDBM50181789 3-(4-fluorophenyl)-5-[(2-methyl-4-thiazolyl)ethynyl]pyridine::CHEMBL201787
SMILES Cc1nc(cs1)C#Cc1cncc(c1)-c1ccc(F)cc1
InChI Key InChIKey=XOIQCSSEVOFYSB-UHFFFAOYSA-N
Data  1 IC50
  Tab Delimited (TSV)   2D SDfile   Computed 3D by Vconf -m prep SDfile
Find this compound or compounds like it in BindingDB:
Activity Spreadsheet -- Enzyme Inhibition Constant Data from BindingDB
Found 1 hit for monomerid = 50181789
TargetMetabotropic glutamate receptor 5(Homo sapiens (Human))
University Of Illinois At Chicago
Curated by ChEMBL
LigandPNGBDBM50181789(3-(4-fluorophenyl)-5-[(2-methyl-4-thiazolyl)ethyny...)
Affinity DataIC50:  162nM. Assay description: Activity in agonist-induced phosphoinositide hydrolysis in CHO cells expressing mGluR5a
In DepthDetails ArticlePubMed