BDBM50181852 3-aminoacetamido-4'-methylfuro[3,2-g]coumarin::CHEMBL202017
SMILES Cc1coc2cc3oc(=O)c(NC(=O)CN)cc3cc12
InChI Key InChIKey=MNKUYMIFZBIEPU-UHFFFAOYSA-N
Data  1 IC50
  Tab Delimited (TSV)   2D SDfile   Computed 3D by Vconf -m prep SDfile
Find this compound or compounds like it in BindingDB:
Activity Spreadsheet -- Enzyme Inhibition Constant Data from BindingDB
Found 1 hit for monomerid = 50181852
TargetAmine oxidase [flavin-containing] A(Homo sapiens (Human))
University Of Santiago De Compostela
Curated by ChEMBL
LigandPNGBDBM50181852(3-aminoacetamido-4'-methylfuro[3,2-g]coumarin | CH...)
Affinity DataIC50:  1.24E+4nM. Assay description: Inhibition of MAO-A activity
In DepthDetails ArticlePubMed