BDBM50181921 2-[5-(5-carbamimidoyl-1H-indol-2-yl)-6-hydroxy-3'-nitro-biphenyl-3-yl]-succinic acid::CHEMBL382879
SMILES NC(=N)c1ccc2[nH]c(cc2c1)-c1cc(cc(c1O)-c1cccc(c1)[N+]([O-])=O)C(CC(O)=O)C(O)=O
InChI Key InChIKey=QVEAACTWBQGJBG-UHFFFAOYSA-N
Data  1 KI
  Tab Delimited (TSV)   2D SDfile   Computed 3D by Vconf -m prep SDfile
Find this compound or compounds like it in BindingDB:
Activity Spreadsheet -- Enzyme Inhibition Constant Data from BindingDB
Found 1 hit for monomerid = 50181921
TargetCoagulation factor VII/Tissue factor(Homo sapiens (Human))
Celera Genomics
Curated by ChEMBL
LigandPNGBDBM50181921(2-[5-(5-carbamimidoyl-1H-indol-2-yl)-6-hydroxy-3'-...)
Affinity DataKi:  1nM. Assay description: Binding affinity to factor7a/TF complex
In DepthDetails ArticlePubMed