BDBM50182027 CHEMBL3819387
SMILES Nc1nc2[nH]c(SCc3cccc(F)c3)nc2c(=O)[nH]1
InChI Key InChIKey=YHSIUQKNIGAJND-UHFFFAOYSA-N
Data  2 Kd
  Tab Delimited (TSV)   2D SDfile   Computed 3D by Vconf -m prep SDfile
Find this compound or compounds like it in BindingDB:
Activity Spreadsheet -- Enzyme Inhibition Constant Data from BindingDB
Found 2 hits for monomerid = 50182027
Target2-amino-4-hydroxy-6-hydroxymethyldihydropteridine diphosphokinase(Staphylococcus aureus)
Monash University
Curated by ChEMBL
LigandPNGBDBM50182027(CHEMBL3819387)
Affinity DataKd:  220nM. Assay description: Binding affinity to biotinylated Staphylococcus aureus HPPK in presence of 1 mM ATP by SPR assay
In DepthDetails ArticlePubMed
Target2-amino-4-hydroxy-6-hydroxymethyldihydropteridine pyrophosphokinase(Escherichia coli (strain K12))
Monash University
Curated by ChEMBL
LigandPNGBDBM50182027(CHEMBL3819387)
Affinity DataKd:  2.60E+3nM. Assay description: Binding affinity to biotinylated Escherichia coli HPPK expressed in Escherichia coli BL21 (DE3) in presence of 1 mM ATP by SPR assay
In DepthDetails ArticlePubMed