BDBM50182088 1-(5-(methylsulfonyl)-3-(4-(trifluoromethyl)phenyl)-4,5,6,7-tetrahydropyrazolo[4,3-c]pyridin-1-yl)-3-(4-(quinolin-4-yl)piperazin-1-yl)propan-2-ol::CHEMBL381271
SMILES CS(=O)(=O)N1CCc2c(C1)c(nn2CC(O)CN1CCN(CC1)c1ccnc2ccccc12)-c1ccc(cc1)C(F)(F)F
InChI Key InChIKey=ACOYYVDPMMDIFE-UHFFFAOYSA-N
Data  1 IC50
  Tab Delimited (TSV)   2D SDfile   Computed 3D by Vconf -m prep SDfile
Find this compound or compounds like it in BindingDB:
Activity Spreadsheet -- Enzyme Inhibition Constant Data from BindingDB
Found 1 hit for monomerid = 50182088
TargetCathepsin S(Homo sapiens (Human))
Johnson And Johnson Pharmaceutical Research And Development
Curated by ChEMBL
LigandPNGBDBM50182088(1-(5-(methylsulfonyl)-3-(4-(trifluoromethyl)phenyl...)
Affinity DataIC50:  1.70E+3nM. Assay description: Inhibition of cathepsin S
In DepthDetails ArticlePubMed