BDBM501823 4-{3-(4-cyclopropylmethoxy- phenyl)-4-methyl-5-oxo-6-[((3S)- pyrrolidin-3-ylmethyl)-amino]- 4,5-dihydro-pyrazin-2-yl}-2- fluoro-benzonitrile::US11028066, Example 61
SMILES Cn1c(-c2ccc(OCC3CC3)cc2)c(nc(NC[C@H]2CCNC2)c1=O)-c1ccc(C#N)c(F)c1
InChI Key InChIKey=SQUOJCWNGIETBF-SFHVURJKSA-N
Data  1 IC50
  Tab Delimited (TSV)   2D SDfile   Computed 3D by Vconf -m prep SDfile
Find this compound or compounds like it in BindingDB:
Activity Spreadsheet -- Enzyme Inhibition Constant Data from BindingDB
Found 1 hit for monomerid = 501823
TargetLysine-specific histone demethylase 1A(Homo sapiens (Human))
Celgene Quanticel Research
US Patent
LigandPNGBDBM501823(4-{3-(4-cyclopropylmethoxy- phenyl)-4-methyl-5-ox...)
Affinity DataIC50: <100nM. Assay description: The enzymatic assay of LSD1 activity is based on Time Resolved-Fluorescence Resonance Energy Transfer (TR-FRET) detection. The inhibitory properties ...
Ligand InfoPC cidPC sid
In DepthDetails US Patent