BDBM50182360 4-(7-((dimethylamino)methyl)-2-(4-fluorophenyl)H-imidazo[1,2-a]pyridin-3-yl)-N,N-dimethylpyrimidin-2-amine::CHEMBL205424
SMILES CN(C)Cc1ccn2c(c(nc2c1)-c1ccc(F)cc1)-c1ccnc(n1)N(C)C
InChI Key InChIKey=SLNHSOFGYCRHGJ-UHFFFAOYSA-N
Data  1 IC50
  Tab Delimited (TSV)   2D SDfile   Computed 3D by Vconf -m prep SDfile
Find this compound or compounds like it in BindingDB:
Activity Spreadsheet -- Enzyme Inhibition Constant Data from BindingDB
Found 1 hit for monomerid = 50182360
TargetcGMP-dependent protein kinase(Eimeria tenella)
Merck Research Laboratories
Curated by ChEMBL
LigandPNGBDBM50182360(4-(7-((dimethylamino)methyl)-2-(4-fluorophenyl)H-i...)
Affinity DataIC50:  2.5nM. Assay description: Inhibitory activity against PKG
In DepthDetails ArticlePubMed