BDBM50182366 (3-(2-aminopyrimidin-4-yl)-2-(4-fluorophenyl)H-imidazo[1,2-a]pyridin-7-yl)methanol::CHEMBL205141
SMILES Nc1nccc(n1)-c1c(nc2cc(CO)ccn12)-c1ccc(F)cc1
InChI Key InChIKey=QVEVYHQKHWTDCI-UHFFFAOYSA-N
Data  1 IC50
  Tab Delimited (TSV)   2D SDfile   Computed 3D by Vconf -m prep SDfile
Find this compound or compounds like it in BindingDB:
Activity Spreadsheet -- Enzyme Inhibition Constant Data from BindingDB
Found 1 hit for monomerid = 50182366
TargetcGMP-dependent protein kinase(Eimeria tenella)
Merck Research Laboratories
Curated by ChEMBL
LigandPNGBDBM50182366((3-(2-aminopyrimidin-4-yl)-2-(4-fluorophenyl)H-imi...)
Affinity DataIC50:  2.70nM. Assay description: Inhibitory activity against PKG
In DepthDetails ArticlePubMed