BDBM50183220 (R)-6-(3-isopropoxy-5-(1-phenylpropan-2-yloxy)benzamido)nicotinic acid::CHEMBL439344
SMILES CC(C)Oc1cc(O[C@H](C)Cc2ccccc2)cc(c1)C(=O)Nc1ccc(cn1)C(O)=O
InChI Key InChIKey=CLRXIUJLHYPICH-QGZVFWFLSA-N
Data  1 EC50
  Tab Delimited (TSV)   2D SDfile   Computed 3D by Vconf -m prep SDfile
Find this compound or compounds like it in BindingDB:
Activity Spreadsheet -- Enzyme Inhibition Constant Data from BindingDB
Found 1 hit for monomerid = 50183220
TargetHexokinase-4(Homo sapiens (Human))
Astrazeneca R&D
Curated by ChEMBL
LigandPNGBDBM50183220((R)-6-(3-isopropoxy-5-(1-phenylpropan-2-yloxy)benz...)
Affinity DataEC50:  90nM. Assay description: Activitation of glucokinase
In DepthDetails ArticlePubMed