BDBM50183503 5,6-dihydroxy-2-pyrazin-2-ylpyrimidine-4-carboxylic acid::CHEMBL205130
SMILES OC(=O)c1nc([nH]c(=O)c1O)-c1cnccn1
InChI Key InChIKey=UUPPOBBBMAWWMW-UHFFFAOYSA-N
Data  1 KI  1 IC50  1 EC50
  Tab Delimited (TSV)   2D SDfile   Computed 3D by Vconf -m prep SDfile
Find this compound or compounds like it in BindingDB:
Activity Spreadsheet -- Enzyme Inhibition Constant Data from BindingDB
Found 3 hits for monomerid = 50183503
TargetPolymerase acidic protein(Hepatitis C virus)
University Of Tennessee Health Science Center
Curated by ChEMBL
LigandPNGBDBM50183503(5,6-dihydroxy-2-pyrazin-2-ylpyrimidine-4-carboxyli...)
Affinity DataKi:  1.10E+3nM. Assay description: Binding affinity to PA N-terminal domain (Competitive)
In DepthDetails ArticlePubMed
TargetPolymerase acidic protein(Hepatitis C virus)
University Of Tennessee Health Science Center
Curated by ChEMBL
LigandPNGBDBM50183503(5,6-dihydroxy-2-pyrazin-2-ylpyrimidine-4-carboxyli...)
Affinity DataEC50:  3.80E+3nM. Assay description: Plaque growth inhibition
In DepthDetails ArticlePubMed
TargetRNA-directed RNA polymerase(Hepatitis C virus)
P. Angeletti S.P.A. (Merck Research Laboratories)
Curated by ChEMBL
LigandPNGBDBM50183503(5,6-dihydroxy-2-pyrazin-2-ylpyrimidine-4-carboxyli...)
Affinity DataIC50:  5.30E+3nM. Assay description: Inhibitory activity against HCV 1b BK NS5B deltaC55 RNA polymerase
In DepthDetails ArticlePubMed