BDBM501836 (S)-4-(2-(4-cyclopropylphenyl)-1- methyl-6-oxo-5-(pyrrolidin-3- ylmethylamino)-1,6- dihydropyridin-3-yl)-2- fluorobenzonitrile::US11028066, Example 74
SMILES Cn1c(-c2ccc(cc2)C2CC2)c(cc(NC[C@H]2CCNC2)c1=O)-c1ccc(C#N)c(F)c1
InChI Key InChIKey=PIRBBOPADNXSKZ-KRWDZBQOSA-N
Data  1 IC50
  Tab Delimited (TSV)   2D SDfile   Computed 3D by Vconf -m prep SDfile
Find this compound or compounds like it in BindingDB:
Activity Spreadsheet -- Enzyme Inhibition Constant Data from BindingDB
Found 1 hit for monomerid = 501836
TargetLysine-specific histone demethylase 1A(Homo sapiens (Human))
Celgene Quanticel Research
US Patent
LigandPNGBDBM501836((S)-4-(2-(4-cyclopropylphenyl)-1- methyl-6-oxo-5-...)
Affinity DataIC50: <100nM. Assay description: The enzymatic assay of LSD1 activity is based on Time Resolved-Fluorescence Resonance Energy Transfer (TR-FRET) detection. The inhibitory properties ...
Ligand InfoPC cidPC sid
In DepthDetails US Patent