BDBM501837 4-[5-(4-aminopiperidin-1-yl)-1- methyl-2-(4-methylphenyl)-6- oxopyridin-3-yl]benzonitrile::US11028066, Example 75
SMILES Cc1ccc(cc1)-c1c(cc(N2CCC(N)CC2)c(=O)n1C)-c1ccc(cc1)C#N
InChI Key InChIKey=IZLXYASYOTWPIV-UHFFFAOYSA-N
Data  1 IC50
  Tab Delimited (TSV)   2D SDfile   Computed 3D by Vconf -m prep SDfile
Find this compound or compounds like it in BindingDB:
Activity Spreadsheet -- Enzyme Inhibition Constant Data from BindingDB
Found 1 hit for monomerid = 501837
TargetLysine-specific histone demethylase 1A(Homo sapiens (Human))
Celgene Quanticel Research
US Patent
LigandPNGBDBM501837(4-[5-(4-aminopiperidin-1-yl)-1- methyl-2-(4-methy...)
Affinity DataIC50: <100nM. Assay description: The enzymatic assay of LSD1 activity is based on Time Resolved-Fluorescence Resonance Energy Transfer (TR-FRET) detection. The inhibitory properties ...
Ligand InfoPC cidPC sid
In DepthDetails US Patent