BDBM50183904 2-(5-(4-fluorophenyl)-4-(pyridin-4-yl)-1H-pyrrol-2-yl)-N,N-dimethylacetamide::CHEMBL208187
SMILES CN(C)C(=O)Cc1cc(c([nH]1)-c1ccc(F)cc1)-c1ccncc1
InChI Key InChIKey=GZLQXBCHXXAQDF-UHFFFAOYSA-N
Data  1 IC50
  Tab Delimited (TSV)   2D SDfile   Computed 3D by Vconf -m prep SDfile
Find this compound or compounds like it in BindingDB:
Activity Spreadsheet -- Enzyme Inhibition Constant Data from BindingDB
Found 1 hit for monomerid = 50183904
TargetcGMP-dependent protein kinase(Eimeria tenella)
Merck Research Laboratories
Curated by ChEMBL
LigandPNGBDBM50183904(2-(5-(4-fluorophenyl)-4-(pyridin-4-yl)-1H-pyrrol-2...)
Affinity DataIC50:  4.10nM. Assay description: Inhibition of Eimeria tenella PKG
In DepthDetails ArticlePubMed