BDBM50184793 1-(2-methoxyphenyl)-4-((1-(pyridin-2-yl)-1H-pyrazol-4-yl)methyl)piperazine::CHEMBL210404
SMILES COc1ccccc1N1CCN(Cc2cnn(c2)-c2ccccn2)CC1
InChI Key InChIKey=BVXSVALQOFIYSP-UHFFFAOYSA-N
Data  5 KI
  Tab Delimited (TSV)   2D SDfile   Computed 3D by Vconf -m prep SDfile
Find this compound or compounds like it in BindingDB:
Activity Spreadsheet -- Enzyme Inhibition Constant Data from BindingDB
Found 5 hits for monomerid = 50184793
TargetD(4) dopamine receptor(Homo sapiens (Human))
Friedrich-Alexander University
Curated by ChEMBL
LigandPNGBDBM50184793(1-(2-methoxyphenyl)-4-((1-(pyridin-2-yl)-1H-pyrazo...)
Affinity DataKi:  0.440nM. Assay description: Displacement of [3H]spiperone from human cloned dopamine D4 receptor expressed in CHO cells
In DepthDetails ArticlePubMed
TargetD(2) dopamine receptor(Homo sapiens (Human))
Friedrich-Alexander University
Curated by ChEMBL
LigandPNGBDBM50184793(1-(2-methoxyphenyl)-4-((1-(pyridin-2-yl)-1H-pyrazo...)
Affinity DataKi:  31nM. Assay description: Displacement of [3H]spiperone from human cloned dopamine D2(short) receptor expressed in CHO cells
In DepthDetails ArticlePubMed
TargetD(2) dopamine receptor(Homo sapiens (Human))
Friedrich-Alexander University
Curated by ChEMBL
LigandPNGBDBM50184793(1-(2-methoxyphenyl)-4-((1-(pyridin-2-yl)-1H-pyrazo...)
Affinity DataKi:  40nM. Assay description: Displacement of [3H]spiperone from human cloned dopamine D2(long) receptor expressed in CHO cells
In DepthDetails ArticlePubMed
TargetD(3) dopamine receptor(Homo sapiens (Human))
Friedrich-Alexander University
Curated by ChEMBL
LigandPNGBDBM50184793(1-(2-methoxyphenyl)-4-((1-(pyridin-2-yl)-1H-pyrazo...)
Affinity DataKi:  72nM. Assay description: Displacement of [3H]spiperone from human cloned dopamine D3 receptor expressed in CHO cells
In DepthDetails ArticlePubMed
TargetD(1A) dopamine receptor(Sus scrofa)
Friedrich-Alexander University
Curated by ChEMBL
LigandPNGBDBM50184793(1-(2-methoxyphenyl)-4-((1-(pyridin-2-yl)-1H-pyrazo...)
Affinity DataKi:  1.90E+3nM. Assay description: Displacement of [3H]SCH23390 from dopamine D1 receptor in porcine striatal membrane
In DepthDetails ArticlePubMed