BDBM50185590 (2-{[(2E)-4-(4-hydroxy-6-methoxy-7-methyl-3-oxo-1,3-dihydro-2-benzofuran-5-yl)-2-methylbut-2-en-1-yl](sulfamoyl)amino}ethyl)phosphonic acid::CHEMBL380155
SMILES COc1c(C)c2COC(=O)c2c(O)c1C\C=C(/C)CN(CCP(O)(O)=O)S(N)(=O)=O
InChI Key InChIKey=IPPCHCUIZKGFGF-ONNFQVAWSA-N
Data  1 IC50
  Tab Delimited (TSV)   2D SDfile   Computed 3D by Vconf -m prep SDfile
Find this compound or compounds like it in BindingDB:
Activity Spreadsheet -- Enzyme Inhibition Constant Data from BindingDB
Found 1 hit for monomerid = 50185590
TargetInosine-5'-monophosphate dehydrogenase 2(Homo sapiens (Human))
Gilead Sciences
Curated by ChEMBL
LigandPNGBDBM50185590((2-{[(2E)-4-(4-hydroxy-6-methoxy-7-methyl-3-oxo-1,...)
Affinity DataIC50:  93nM. Assay description: Inhibition of human IMPDH2
In DepthDetails ArticlePubMed