BDBM50185842 4,9a-dibutyl-7-hydroxy-1,2,9,9a-tetrahydrofluoren-3-one::CHEMBL210143
SMILES CCCCC1=C2c3ccc(O)cc3CC2(CCCC)CCC1=O
InChI Key InChIKey=OPGFNEMXUAVHOH-UHFFFAOYSA-N
Data  3 IC50  1 EC50
  Tab Delimited (TSV)   2D SDfile   Computed 3D by Vconf -m prep SDfile
Find this compound or compounds like it in BindingDB:
Activity Spreadsheet -- Enzyme Inhibition Constant Data from BindingDB
Found 4 hits for monomerid = 50185842
TargetEstrogen receptor beta(Homo sapiens (Human))
Merck Research Laboratories
Curated by ChEMBL
LigandPNGBDBM50185842(4,9a-dibutyl-7-hydroxy-1,2,9,9a-tetrahydrofluoren-...)
Affinity DataIC50:  15nM. Assay description: Binding affinity to ERbeta by scintillation proximity assay
In DepthDetails ArticlePubMed
TargetEstrogen receptor beta(Homo sapiens (Human))
Merck Research Laboratories
Curated by ChEMBL
LigandPNGBDBM50185842(4,9a-dibutyl-7-hydroxy-1,2,9,9a-tetrahydrofluoren-...)
Affinity DataEC50:  30nM. Assay description: Activity at human ERbeta transfected in HEK293 cells assessed as transactivation of alkaline phosphatase reporter gene
In DepthDetails ArticlePubMed
TargetEstrogen receptor(Homo sapiens (Human))
Merck Research Laboratories
Curated by ChEMBL
LigandPNGBDBM50185842(4,9a-dibutyl-7-hydroxy-1,2,9,9a-tetrahydrofluoren-...)
Affinity DataIC50:  273nM. Assay description: Binding affinity to ERalpha by scintillation proximity assay
In DepthDetails ArticlePubMed
TargetEstrogen receptor beta(Homo sapiens (Human))
Merck Research Laboratories
Curated by ChEMBL
LigandPNGBDBM50185842(4,9a-dibutyl-7-hydroxy-1,2,9,9a-tetrahydrofluoren-...)
Affinity DataIC50:  40nM. Assay description: Activity at human ERbeta transfected in HEK293 cells assessed as transactivation of alkaline phosphatase reporter gene
In DepthDetails ArticlePubMed